BDBM51396 3-cyclohexyl-N-(1H-1,2,4-triazol-5-yl)propanamide::3-cyclohexyl-N-(1H-1,2,4-triazol-5-yl)propionamide::MLS-0026826.0001::cid_803937
SMILES O=C(CCC1CCCCC1)Nc1nnc[nH]1
InChI Key InChIKey=UZEDCSMOVBZQDH-UHFFFAOYSA-N
Data  2 EC50
  Tab Delimited (TSV)   2D SDfile   Computed 3D by Vconf -m prep SDfile
Find this compound or compounds like it in BindingDB:
Activity Spreadsheet -- Enzyme Inhibition Constant Data from BindingDB
Found 2 hits for monomerid = 51396
TargetAlkaline phosphatase, tissue-nonspecific isozyme(Homo sapiens (Human))
Burnham Center For Chemical Genomics
Curated by PubChem BioAssay
LigandPNGBDBM51396(3-cyclohexyl-N-(1H-1,2,4-triazol-5-yl)propanamide ...)
Affinity DataEC50:  1.00E+5nM. Assay description: Data Source: Sanford-Burnham Center for Chemical Genomics (SBCCG) Source Affiliation: Sanford-Burnham Medical Research Institute (SBMRI, San Diego, C...
In DepthDetails PCBioAssay
TargetAlkaline phosphatase, tissue-nonspecific isozyme(Homo sapiens (Human))
Burnham Center For Chemical Genomics
Curated by PubChem BioAssay
LigandPNGBDBM51396(3-cyclohexyl-N-(1H-1,2,4-triazol-5-yl)propanamide ...)
Affinity DataEC50:  7.79E+3nM. Assay description: Data Source: Sanford-Burnham Center for Chemical Genomics (SBCCG) Source Affiliation: Sanford-Burnham Medical Research Institute (SBMRI, San Diego, C...
In DepthDetails PCBioAssay